Reaction Details
TargetCyclin-dependent kinase 1
LigandBDBM7584
Substrate/Competitorn/a
Meas. Tech.ChEMBL_50319 (CHEMBL661624)
IC50 60±n/a nM
Citation Ducrot, PLegraverend, MGrierson, DS 3D-QSAR CoMFA on cyclin-dependent kinase inhibitors. J Med Chem43:4098-108 (2000) Cyclin-dependent kinase 1
Name:Cyclin-dependent kinase 1
Type:Enzyme Subunit
Mol. Mass.:34101.08
Organism:Homo sapiens (Human)
Description:P06493
Residue:297
BDBM7584
NameBDBM7584
Synonyms:1-{6-[(3-chlorophenyl)amino]-9-(propan-2-yl)-9H-purin-2-yl}-3-methylpent-1-yn-3-ol C-2 alkynylated purine deriv. 5e | CHEMBL282193
TypeSmall organic molecule
Emp. Form.C20H22ClN5O
Mol. Mass.383.875
SMILESCCC(C)(O)C#Cc1nc(Nc2cccc(Cl)c2)c2ncn(C(C)C)c2n1