Reaction Details
TargetCyclin-dependent kinase 1
LigandBDBM7553
Substrate/Competitorn/a
Meas. Tech.ChEMBL_50319 (CHEMBL661624)
IC50 180±n/a nM
Citation Ducrot, PLegraverend, MGrierson, DS 3D-QSAR CoMFA on cyclin-dependent kinase inhibitors. J Med Chem43:4098-108 (2000) Cyclin-dependent kinase 1
Name:Cyclin-dependent kinase 1
Type:Enzyme Subunit
Mol. Mass.:34101.08
Organism:Homo sapiens (Human)
Description:P06493
Residue:297
BDBM7553
NameBDBM7553
Synonyms:1-{2-[6-(benzylamino)-9-(propan-2-yl)-9H-purin-2-yl]ethynyl}cyclohexan-1-ol CHEMBL134239
TypeSmall organic molecule
Emp. Form.C23H27N5O
Mol. Mass.389.4934
SMILESCC(C)n1cnc2c(NCc3ccccc3)nc(nc12)C#CC1(O)CCCCC1