Reaction Details
TargetCyclin-dependent kinase 5
LigandBDBM7514
Substrate/Competitorn/a
Meas. Tech.ChEMBL_51306 (CHEMBL884356)
IC50 2400±n/a nM
Citation Ducrot, PLegraverend, MGrierson, DS 3D-QSAR CoMFA on cyclin-dependent kinase inhibitors. J Med Chem43:4098-108 (2000) Cyclin-dependent kinase 5
Name:Cyclin-dependent kinase 5
Type:Enzyme Subunit
Mol. Mass.:33308.61
Organism:Homo sapiens (Human)
Description:n/a
Residue:292
BDBM7514
NameBDBM7514
Synonyms:2,6,9-Trisubstituted purine deriv. 9 | [(2S)-1-[6-(benzylamino)-9-(propan-2-yl)-9H-purin-2-yl]pyrrolidin-2-yl]methanol
TypeSmall organic molecule
Emp. Form.C20H26N6O
Mol. Mass.366.46
SMILESCC(C)n1cnc2c(NCc3ccccc3)nc(nc12)N1CCC[C@H]1CO