Reaction Details
TargetReverse transcriptase/RNaseH
LigandBDBM50094288
Substrate/Competitorn/a
Meas. Tech.ChEMBL_79464 (CHEMBL694660)
EC50 1.3±n/a nM
Citation Ohrui, HKohgo, SKitano, KSakata, SKodama, EYoshimura, KMatsuoka, MShigeta, SMitsuya, H Syntheses of 4'-C-ethynyl-beta-D-arabino- and 4'-C-ethynyl-2'-deoxy-beta-D-ribo-pentofuranosylpyrimidines and -purines and evaluation of their anti-HIV activity. J Med Chem43:4516-25 (2000) Reverse transcriptase/RNaseH
Name:Reverse transcriptase/RNaseH
Type:PROTEIN
Mol. Mass.:65229.15
Organism:Human immunodeficiency virus 1
Description:ChEMBL_1473730
Residue:566
BDBM50094288
NameBDBM50094288
Synonyms:5-(2,6-Diamino-purin-9-yl)-2-ethynyl-2-hydroxymethyl-tetrahydro-furan-3-ol | CHEMBL138639
TypeSmall organic molecule
Emp. Form.C12H14N6O3
Mol. Mass.290.278
SMILESNc1nc(N)c2ncn([C@H]3C[C@@H](O)[C@@](CO)(O3)C#C)c2n1