Reaction Details
TargetReverse transcriptase/RNaseH
LigandBDBM50409049
Substrate/Competitorn/a
Meas. Tech.ChEMBL_79461 (CHEMBL694657)
EC50>350000±n/a nM
Citation Ohrui, HKohgo, SKitano, KSakata, SKodama, EYoshimura, KMatsuoka, MShigeta, SMitsuya, H Syntheses of 4'-C-ethynyl-beta-D-arabino- and 4'-C-ethynyl-2'-deoxy-beta-D-ribo-pentofuranosylpyrimidines and -purines and evaluation of their anti-HIV activity. J Med Chem43:4516-25 (2000) Reverse transcriptase/RNaseH
Name:Reverse transcriptase/RNaseH
Type:PROTEIN
Mol. Mass.:65229.15
Organism:Human immunodeficiency virus 1
Description:ChEMBL_1473730
Residue:566
BDBM50409049
NameBDBM50409049
Synonyms:CHEMBL607510
TypeSmall organic molecule
Emp. Form.C12H16N2O6
Mol. Mass.284.2652
SMILESCC1=CN(C2O[C@@](CO)(C#C)[C@@H](O)[C@@H]2O)C(=O)NC1O