Reaction Details
TargetReverse transcriptase/RNaseH
LigandBDBM50094286
Substrate/Competitorn/a
Meas. Tech.ChEMBL_79461 (CHEMBL694657)
EC50 4.8±n/a nM
Citation Ohrui, HKohgo, SKitano, KSakata, SKodama, EYoshimura, KMatsuoka, MShigeta, SMitsuya, H Syntheses of 4'-C-ethynyl-beta-D-arabino- and 4'-C-ethynyl-2'-deoxy-beta-D-ribo-pentofuranosylpyrimidines and -purines and evaluation of their anti-HIV activity. J Med Chem43:4516-25 (2000) Reverse transcriptase/RNaseH
Name:Reverse transcriptase/RNaseH
Type:PROTEIN
Mol. Mass.:65229.15
Organism:Human immunodeficiency virus 1
Description:ChEMBL_1473730
Residue:566
BDBM50094286
NameBDBM50094286
Synonyms:4-Amino-1-(5-ethynyl-4-hydroxy-5-hydroxymethyl-tetrahydro-furan-2-yl)-1H-pyrimidin-2-one | CHEMBL141923
TypeSmall organic molecule
Emp. Form.C11H13N3O4
Mol. Mass.251.2386
SMILESNc1ccn([C@H]2C[C@@H](O)[C@@](CO)(O2)C#C)c(=O)n1