Reaction Details
TargetReverse transcriptase/RNaseH
LigandBDBM50094285
Substrate/Competitorn/a
Meas. Tech.ChEMBL_79461 (CHEMBL694657)
EC50 340±n/a nM
Citation Ohrui, HKohgo, SKitano, KSakata, SKodama, EYoshimura, KMatsuoka, MShigeta, SMitsuya, H Syntheses of 4'-C-ethynyl-beta-D-arabino- and 4'-C-ethynyl-2'-deoxy-beta-D-ribo-pentofuranosylpyrimidines and -purines and evaluation of their anti-HIV activity. J Med Chem43:4516-25 (2000) Reverse transcriptase/RNaseH
Name:Reverse transcriptase/RNaseH
Type:PROTEIN
Mol. Mass.:65229.15
Organism:Human immunodeficiency virus 1
Description:ChEMBL_1473730
Residue:566
BDBM50094285
NameBDBM50094285
Synonyms:1-(5-Ethynyl-4-hydroxy-5-hydroxymethyl-tetrahydro-furan-2-yl)-5-iodo-1H-pyrimidine-2,4-dione | CHEMBL410492
TypeSmall organic molecule
Emp. Form.C11H11IN2O5
Mol. Mass.378.1199
SMILESOC[C@]1(O[C@H](C[C@H]1O)n1cc(I)c(=O)[nH]c1=O)C#C