Reaction Details
TargetReverse transcriptase/RNaseH
LigandBDBM50094279
Substrate/Competitorn/a
Meas. Tech.ChEMBL_79461 (CHEMBL694657)
EC50 117000±n/a nM
Citation Ohrui, HKohgo, SKitano, KSakata, SKodama, EYoshimura, KMatsuoka, MShigeta, SMitsuya, H Syntheses of 4'-C-ethynyl-beta-D-arabino- and 4'-C-ethynyl-2'-deoxy-beta-D-ribo-pentofuranosylpyrimidines and -purines and evaluation of their anti-HIV activity. J Med Chem43:4516-25 (2000) Reverse transcriptase/RNaseH
Name:Reverse transcriptase/RNaseH
Type:PROTEIN
Mol. Mass.:65229.15
Organism:Human immunodeficiency virus 1
Description:ChEMBL_1473730
Residue:566
BDBM50094279
NameBDBM50094279
Synonyms:2-Ethynyl-2-hydroxymethyl-5-purin-9-yl-tetrahydro-furan-3-ol | CHEMBL337135
TypeSmall organic molecule
Emp. Form.C12H12N4O3
Mol. Mass.260.2487
SMILESOC[C@]1(O[C@H](C[C@H]1O)n1cnc2cncnc12)C#C