Reaction Details
TargetCarbonic anhydrase 2
LigandBDBM50094346
Substrate/Competitorn/a
Meas. Tech.ChEMBL_45236 (CHEMBL657194)
Ki 0.5±n/a nM
Citation Scozzafava, AMenabuoni, LMincione, FBriganti, FMincione, GSupuran, CT Carbonic anhydrase inhibitors: perfluoroalkyl/aryl-substituted derivatives of aromatic/heterocyclic sulfonamides as topical intraocular pressure-lowering agents with prolonged duration of action. J Med Chem43:4542-51 (2000) Carbonic anhydrase 2
Name:Carbonic anhydrase 2
Type:Enzyme
Mol. Mass.:29250.71
Organism:Homo sapiens (Human)
Description:P00918
Residue:260
BDBM50094346
NameBDBM50094346
Synonyms:1,1,2,2,3,3,4,4,4-Nonafluoro-butane-1-sulfonic acid 2-sulfamoyl-benzothiazol-6-yl ester | CHEMBL141899
TypeSmall organic molecule
Emp. Form.C11H5F9N2O5S3
Mol. Mass.512.348
SMILESNS(=O)(=O)c1nc2ccc(OS(=O)(=O)C(F)(F)C(F)(F)C(F)(F)C(F)(F)F)cc2s1