Reaction Details
TargetCarbonic anhydrase 2
LigandBDBM50094347
Substrate/Competitorn/a
Meas. Tech.ChEMBL_45236 (CHEMBL657194)
Ki 0.3±n/a nM
Citation Scozzafava, AMenabuoni, LMincione, FBriganti, FMincione, GSupuran, CT Carbonic anhydrase inhibitors: perfluoroalkyl/aryl-substituted derivatives of aromatic/heterocyclic sulfonamides as topical intraocular pressure-lowering agents with prolonged duration of action. J Med Chem43:4542-51 (2000) Carbonic anhydrase 2
Name:Carbonic anhydrase 2
Type:Enzyme
Mol. Mass.:29250.71
Organism:Homo sapiens (Human)
Description:P00918
Residue:260
BDBM50094347
NameBDBM50094347
Synonyms:5-(perfluorophenylsulfonamido)-1,3,4-thiadiazole-2-sulfonamide CHEMBL94836
TypeSmall organic molecule
Emp. Form.C8H3F5N4O4S3
Mol. Mass.410.321
SMILESNS(=O)(=O)c1nnc(NS(=O)(=O)c2c(F)c(F)c(F)c(F)c2F)s1