Reaction Details
TargetCarbonic anhydrase 2
LigandBDBM50094322
Substrate/Competitorn/a
Meas. Tech.ChEMBL_45236 (CHEMBL657194)
Ki 1.5±n/a nM
Citation Scozzafava, AMenabuoni, LMincione, FBriganti, FMincione, GSupuran, CT Carbonic anhydrase inhibitors: perfluoroalkyl/aryl-substituted derivatives of aromatic/heterocyclic sulfonamides as topical intraocular pressure-lowering agents with prolonged duration of action. J Med Chem43:4542-51 (2000) Carbonic anhydrase 2
Name:Carbonic anhydrase 2
Type:Enzyme
Mol. Mass.:29250.71
Organism:Homo sapiens (Human)
Description:P00918
Residue:260
BDBM50094322
NameBDBM50094322
Synonyms:2,2,3,3,4,4,5,5,6,6,7,7,8,8,9,9,9-Heptadecafluoro-nonanoic acid [4-(5-sulfamoyl-[1,3,4]thiadiazol-2-ylsulfamoyl)-phenyl]-amide | CHEMBL343048
TypeSmall organic molecule
Emp. Form.C17H8F17N5O5S3
Mol. Mass.781.444
SMILESNS(=O)(=O)c1nnc(NS(=O)(=O)c2ccc(NC(=O)C(F)(F)C(F)(F)C(F)(F)C(F)(F)C(F)(F)C(F)(F)C(F)(F)C(F)(F)F)cc2)s1