Reaction Details
TargetCarbonic anhydrase 2
LigandBDBM50094412
Substrate/Competitorn/a
Meas. Tech.ChEMBL_45236 (CHEMBL657194)
Ki 2±n/a nM
Citation Scozzafava, AMenabuoni, LMincione, FBriganti, FMincione, GSupuran, CT Carbonic anhydrase inhibitors: perfluoroalkyl/aryl-substituted derivatives of aromatic/heterocyclic sulfonamides as topical intraocular pressure-lowering agents with prolonged duration of action. J Med Chem43:4542-51 (2000) Carbonic anhydrase 2
Name:Carbonic anhydrase 2
Type:Enzyme
Mol. Mass.:29250.71
Organism:Homo sapiens (Human)
Description:P00918
Residue:260
BDBM50094412
NameBDBM50094412
Synonyms:4-Methyl-5-(nonafluorobutane-1-sulfonylimino)-4,5-dihydro-[1,3,4]thiadiazole-2-sulfonic acid amide | CHEMBL140879
TypeSmall organic molecule
Emp. Form.C7H5F9N4O4S3
Mol. Mass.476.32
SMILESCn1nc(sc1=NS(=O)(=O)C(F)(F)C(F)(F)C(F)(F)C(F)(F)F)S(N)(=O)=O