Reaction Details
TargetCarbonic anhydrase 2
LigandBDBM50094456
Substrate/Competitorn/a
Meas. Tech.ChEMBL_45236 (CHEMBL657194)
Ki 0.2±n/a nM
Citation Scozzafava, AMenabuoni, LMincione, FBriganti, FMincione, GSupuran, CT Carbonic anhydrase inhibitors: perfluoroalkyl/aryl-substituted derivatives of aromatic/heterocyclic sulfonamides as topical intraocular pressure-lowering agents with prolonged duration of action. J Med Chem43:4542-51 (2000) Carbonic anhydrase 2
Name:Carbonic anhydrase 2
Type:Enzyme
Mol. Mass.:29250.71
Organism:Homo sapiens (Human)
Description:P00918
Residue:260
BDBM50094456
NameBDBM50094456
Synonyms:6-Pentafluorobenzenesulfonylamino-benzothiazole-2-sulfonic acid amide | CHEMBL140110
TypeSmall organic molecule
Emp. Form.C13H6F5N3O4S3
Mol. Mass.459.391
SMILESNS(=O)(=O)c1nc2ccc(NS(=O)(=O)c3c(F)c(F)c(F)c(F)c3F)cc2s1