Reaction Details
TargetProstaglandin G/H synthase 2
LigandBDBM50094535
Substrate/Competitorn/a
Meas. Tech.ChEMBL_157848 (CHEMBL768586)
IC50 3.3±n/a nM
Citation Portevin, BTordjman, CPastoureau, PBonnet, JDe Nanteuil G, na 1,3-Diaryl-4,5,6,7-tetrahydro-2H-isoindole derivatives: a new series of potent and selective COX-2 inhibitors in which a sulfonyl group is not a structural requisite. J Med Chem43:4582-93 (2001) Prostaglandin G/H synthase 2
Name:Prostaglandin G/H synthase 2
Type:Protein
Mol. Mass.:69020.39
Organism:Mus musculus (Mouse)
Description:Q05769
Residue:604
BDBM50094535
NameBDBM50094535
Synonyms:1,3-diphenyl-4,7-dihydro-2H-isoindole | CHEMBL140804
TypeSmall organic molecule
Emp. Form.C20H17N
Mol. Mass.271.3557
SMILESC1C=CCc2c1c([nH]c2-c1ccccc1)-c1ccccc1