Reaction Details
TargetProstaglandin G/H synthase 2
LigandBDBM50094546
Substrate/Competitorn/a
Meas. Tech.ChEMBL_157848 (CHEMBL768586)
IC50 1.6±n/a nM
Citation Portevin, BTordjman, CPastoureau, PBonnet, JDe Nanteuil G, na 1,3-Diaryl-4,5,6,7-tetrahydro-2H-isoindole derivatives: a new series of potent and selective COX-2 inhibitors in which a sulfonyl group is not a structural requisite. J Med Chem43:4582-93 (2001) Prostaglandin G/H synthase 2
Name:Prostaglandin G/H synthase 2
Type:Protein
Mol. Mass.:69020.39
Organism:Mus musculus (Mouse)
Description:Q05769
Residue:604
BDBM50094546
NameBDBM50094546
Synonyms:3,5-Diphenyl-4-aza-tricyclo[5.2.2.0*2,6*]undeca-2,5-diene | CHEMBL343701
TypeSmall organic molecule
Emp. Form.C22H21N
Mol. Mass.299.4088
SMILESC1CC2CCC1c1c([nH]c(c21)-c1ccccc1)-c1ccccc1