Reaction Details
TargetProstaglandin G/H synthase 2
LigandBDBM50094563
Substrate/Competitorn/a
Meas. Tech.ChEMBL_157848 (CHEMBL768586)
IC50 1.67±n/a nM
Citation Portevin, BTordjman, CPastoureau, PBonnet, JDe Nanteuil G, na 1,3-Diaryl-4,5,6,7-tetrahydro-2H-isoindole derivatives: a new series of potent and selective COX-2 inhibitors in which a sulfonyl group is not a structural requisite. J Med Chem43:4582-93 (2001) Prostaglandin G/H synthase 2
Name:Prostaglandin G/H synthase 2
Type:Protein
Mol. Mass.:69020.39
Organism:Mus musculus (Mouse)
Description:Q05769
Residue:604
BDBM50094563
NameBDBM50094563
Synonyms:1,3-Di-p-tolyl-4,5,6,7-tetrahydro-2H-isoindole CHEMBL140991
TypeSmall organic molecule
Emp. Form.C22H23N
Mol. Mass.301.4247
SMILESCc1ccc(cc1)-c1[nH]c(c2CCCCc12)-c1ccc(C)cc1