Reaction Details
TargetAcetylcholinesterase
LigandBDBM50369748
Substrate/Competitorn/a
Meas. Tech.ChEMBL_27811 (CHEMBL636701)
IC50 2.77±n/a nM
Citation Camps, PEl Achab R, naMorral, JMuñoz-Torrero, DBadia, ABaños, JEVivas, NMBarril, XOrozco, MLuque, FJ New tacrine-huperzine A hybrids (huprines): highly potent tight-binding acetylcholinesterase inhibitors of interest for the treatment of Alzheimer's disease. J Med Chem43:4657-66 (2001) Acetylcholinesterase
Name:Acetylcholinesterase
Type:Enzyme
Mol. Mass.:67659.62
Organism:Bos taurus (bovine)
Description:n/a
Residue:613
BDBM50369748
NameBDBM50369748
Synonyms:CHEMBL208599
TypeSmall organic molecule
Emp. Form.C18H19ClN2
Mol. Mass.298.81
SMILESCCC1=CC2C[C@H](C1)c1c(C2)nc2cc(Cl)ccc2c1N