Reaction Details
TargetAcetylcholinesterase
LigandBDBM10592
Substrate/Competitorn/a
Meas. Tech.ChEMBL_28153 (CHEMBL644108)
IC50 0.780±n/a nM
Citation Camps, PEl Achab R, naMorral, JMuñoz-Torrero, DBadia, ABaños, JEVivas, NMBarril, XOrozco, MLuque, FJ New tacrine-huperzine A hybrids (huprines): highly potent tight-binding acetylcholinesterase inhibitors of interest for the treatment of Alzheimer's disease. J Med Chem43:4657-66 (2001) Acetylcholinesterase
Name:Acetylcholinesterase
Type:Enzyme
Mol. Mass.:67792.70
Organism:Homo sapiens (Human)
Description:P22303
Residue:614
BDBM10592
NameBDBM10592
Synonyms:7-chloro-15-methyl-10-azatetracyclo[11.3.1.0^{2,11}.0^{4,9}]heptadeca-2,4(9),5,7,10,14-hexaen-3-amine Huprine Y.HCl | US9238626, (+/-)-Huprine Y HCl
TypeSmall organic molecule
Emp. Form.C17H17ClN2
Mol. Mass.284.783
SMILESCC1=CC2CC(C1)c1c(C2)nc2cc(Cl)ccc2c1N