Reaction Details
TargetAcyl carrier protein,/NADH dehydrogenase [ubiquinone] flavoprotein 1, mitochondrial
LigandBDBM50094723
Substrate/Competitorn/a
Meas. Tech.ChEMBL_141740 (CHEMBL749252)
IC50 1.5±n/a nM
Citation Gallardo, TZafra-Polo, MCTormo, JRGonzález, MCFranck, XEstornell, ECortes, D Semisynthesis of antitumoral acetogenins: SAR of functionalized alkyl-chain bis-tetrahydrofuranic acetogenins, specific inhibitors of mitochondrial complex I. J Med Chem43:4793-800 (2000) Acyl carrier protein,/NADH dehydrogenase [ubiquinone] flavoprotein 1, mitochondrial
Name:Acyl carrier protein,/NADH dehydrogenase [ubiquinone] flavoprotein 1, mitochondrial
Synonyms:Mitochondrial complex I; NADH oxidoreductase
Type:n/a
Mol. Mass.:n/a
Description:ASSAY_ID of EBI is 141738
Components:This complex has 2 components.
Component 1
Name:NADH dehydrogenase [ubiquinone] flavoprotein 1, mitochondrial
Type:PROTEIN
Mol. Mass.:50659.85
Organism:Bos taurus
Description:EBI_100771
Residue:464
Component 2
Name:Acyl carrier protein, mitochondrial
Synonyms:ACP CI-SDAP NDUFAB1
Type:PROTEIN
Mol. Mass.:17397.64
Organism:Bos taurus
Description:ChEMBL_469770
Residue:156
BDBM50094723
NameBDBM50094723
Synonyms:Acetic acid 12-acetoxy-12-[5'-(1-acetoxy-undecyl)-octahydro-[2,2']bifuranyl-5-yl]-1-(5-methyl-2-oxo-2,5-dihydro-furan-3-ylmethyl)-dodecyl ester | CHEMBL145485
TypeSmall organic molecule
Emp. Form.C43H72O10
Mol. Mass.749.0258
SMILESCCCCCCCCCC[C@H](OC(C)=O)[C@H]1CC[C@H](O1)[C@@H]1CC[C@@H](O1)[C@@H](CCCCCCCCCC[C@H](CC1=C[C@H](C)OC1=O)OC(C)=O)OC(C)=O