Reaction Details
TargetAcyl carrier protein,/NADH dehydrogenase [ubiquinone] flavoprotein 1, mitochondrial
LigandBDBM50094721
Substrate/Competitorn/a
Meas. Tech.ChEMBL_141740 (CHEMBL749252)
IC50 1.7±n/a nM
Citation Gallardo, TZafra-Polo, MCTormo, JRGonzález, MCFranck, XEstornell, ECortes, D Semisynthesis of antitumoral acetogenins: SAR of functionalized alkyl-chain bis-tetrahydrofuranic acetogenins, specific inhibitors of mitochondrial complex I. J Med Chem43:4793-800 (2000) Acyl carrier protein,/NADH dehydrogenase [ubiquinone] flavoprotein 1, mitochondrial
Name:Acyl carrier protein,/NADH dehydrogenase [ubiquinone] flavoprotein 1, mitochondrial
Synonyms:Mitochondrial complex I; NADH oxidoreductase
Type:n/a
Mol. Mass.:n/a
Description:ASSAY_ID of EBI is 141738
Components:This complex has 2 components.
Component 1
Name:NADH dehydrogenase [ubiquinone] flavoprotein 1, mitochondrial
Type:PROTEIN
Mol. Mass.:50659.85
Organism:Bos taurus
Description:EBI_100771
Residue:464
Component 2
Name:Acyl carrier protein, mitochondrial
Synonyms:ACP CI-SDAP NDUFAB1
Type:PROTEIN
Mol. Mass.:17397.64
Organism:Bos taurus
Description:ChEMBL_469770
Residue:156
BDBM50094721
NameBDBM50094721
Synonyms:CHEMBL145555 | Methanesulfonic acid 12-methanesulfonyloxy-12-[5'-(1-methanesulfonyloxy-undecyl)-octahydro-[2,2']bifuranyl-5-yl]-1-(5-methyl-2-oxo-2,5-dihydro-furan-3-ylmethyl)-dodecyl ester
TypeSmall organic molecule
Emp. Form.C40H72O13S3
Mol. Mass.857.187
SMILESCCCCCCCCCC[C@H](OS(C)(=O)=O)[C@H]1CC[C@H](O1)[C@@H]1CC[C@@H](O1)[C@@H](CCCCCCCCCC[C@H](CC1=C[C@H](C)OC1=O)OS(C)(=O)=O)OS(C)(=O)=O