Reaction Details
TargetSodium-dependent serotonin transporter
LigandBDBM50095630
Substrate/Competitorn/a
Meas. Tech.ChEMBL_198188 (CHEMBL799116)
Ki 4.7±n/a nM
Citation Froimowitz, MWu, KMMoussa, AHaidar, RMJurayj, JGeorge, CGardner, EL Slow-onset, long-duration 3-(3',4'-dichlorophenyl)-1-indanamine monoamine reuptake blockers as potential medications to treat cocaine abuse. J Med Chem43:4981-92 (2001) Sodium-dependent serotonin transporter
Name:Sodium-dependent serotonin transporter
Type:Multi-pass membrane protein
Mol. Mass.:70322.51
Organism:Homo sapiens (Human)
Description:P31645
Residue:630
BDBM50095630
NameBDBM50095630
Synonyms:CHEMBL356552 | [3-(3,4-Dichloro-phenyl)-indan-1-yl]-ethyl-methyl-amine;chloride
TypeSmall organic molecule
Emp. Form.C17H17Cl2N
Mol. Mass.306.23
SMILESCCN[C@H]1C[C@H](c2ccccc12)c1ccc(Cl)c(Cl)c1