Reaction Details
TargetSodium-dependent serotonin transporter
LigandBDBM50369770
Substrate/Competitorn/a
Meas. Tech.ChEMBL_198188 (CHEMBL799116)
Ki 0.33±n/a nM
Citation Froimowitz, MWu, KMMoussa, AHaidar, RMJurayj, JGeorge, CGardner, EL Slow-onset, long-duration 3-(3',4'-dichlorophenyl)-1-indanamine monoamine reuptake blockers as potential medications to treat cocaine abuse. J Med Chem43:4981-92 (2001) Sodium-dependent serotonin transporter
Name:Sodium-dependent serotonin transporter
Type:Multi-pass membrane protein
Mol. Mass.:70322.51
Organism:Homo sapiens (Human)
Description:P31645
Residue:630
BDBM50369770
NameBDBM50369770
Synonyms:CHEMBL1788140
TypeSmall organic molecule
Emp. Form.C17H17Cl2N
Mol. Mass.306.23
SMILESCN(C)[C@@H]1C[C@H](c2ccccc12)c1ccc(Cl)c(Cl)c1