Reaction Details
TargetSerine protease 1
LigandBDBM50084616
Substrate/Competitorn/a
Meas. Tech.ChEMBL_213067 (CHEMBL817134)
Ki 84000±n/a nM
Citation Leung, DAbbenante, GFairlie, DP Protease inhibitors: current status and future prospects. J Med Chem43:305-41 (2000) Serine protease 1
Name:Serine protease 1
Type:Enzyme
Mol. Mass.:26557.80
Organism:Homo sapiens (Human)
Description:P07477
Residue:247
BDBM50084616
NameBDBM50084616
Synonyms:CHEMBL310290 | [(4-Aminomethyl-benzylcarbamoyl)-methyl]-carbamic acid 4-[(4-aminomethyl-benzylcarbamoyl)-methylcarbamoyloxymethyl]-benzyl ester
TypeSmall organic molecule
Emp. Form.C30H36N6O6
Mol. Mass.576.6434
SMILESNCc1ccc(CNC(=O)CNC(=O)OCc2ccc(COC(=O)NCC(=O)NCc3ccc(CN)cc3)cc2)cc1