Reaction Details
TargetNeutrophil elastase
LigandBDBM50084620
Substrate/Competitorn/a
Meas. Tech.ChEMBL_63837 (CHEMBL674887)
Ki 20±n/a nM
Citation Leung, DAbbenante, GFairlie, DP Protease inhibitors: current status and future prospects. J Med Chem43:305-41 (2000) Neutrophil elastase
Name:Neutrophil elastase
Type:Enzyme
Mol. Mass.:28532.38
Organism:Homo sapiens (Human)
Description:P08246
Residue:267
BDBM50084620
NameBDBM50084620
Synonyms:1-{3-Methyl-2-[4-(tetrahydro-pyran-4-carbonyl)-benzoylamino]-butyryl}-pyrrolidine-2-carboxylic acid (3,3,4,4,4-pentafluoro-1-isopropyl-2-oxo-butyl)-amide(MDL101,146) | CHEMBL115817
TypeSmall organic molecule
Emp. Form.C30H38F5N3O6
Mol. Mass.631.6312
SMILESCC(C)[C@H](NC(=O)c1ccc(cc1)C(=O)C1CCOCC1)C(=O)N1CCCC1C(=O)NC(C(C)C)C(=O)C(F)(F)C(F)(F)F