Reaction Details
TargetCoagulation factor X
LigandBDBM50084638
Substrate/Competitorn/a
Meas. Tech.ChEMBL_48981 (CHEMBL663511)
IC50 30±n/a nM
Citation Leung, DAbbenante, GFairlie, DP Protease inhibitors: current status and future prospects. J Med Chem43:305-41 (2000) Coagulation factor X
Name:Coagulation factor X
Type:Enzyme
Mol. Mass.:54726.60
Organism:Homo sapiens (Human)
Description:n/a
Residue:488
BDBM50084638
NameBDBM50084638
Synonyms:2-(3-Carbamimidoyl-benzyl)-3-[(3',4'-dimethoxy-biphenyl-4-carbonyl)-amino]-5-phenyl-pent-4-enoic acid methyl ester | CHEMBL324058
TypeSmall organic molecule
Emp. Form.C35H35N3O5
Mol. Mass.577.6695
SMILESCOC(=O)[C@H](Cc1cccc(c1)C(N)=N)[C@H](NC(=O)c1ccc(cc1)-c1ccc(OC)c(OC)c1)\C=C\c1ccccc1