Reaction Details
TargetNeutrophil elastase
LigandBDBM50035947
Substrate/Competitorn/a
Meas. Tech.ChEMBL_63838 (CHEMBL674888)
Ki 9.4±n/a nM
Citation Leung, DAbbenante, GFairlie, DP Protease inhibitors: current status and future prospects. J Med Chem43:305-41 (2000) Neutrophil elastase
Name:Neutrophil elastase
Type:Enzyme
Mol. Mass.:28532.38
Organism:Homo sapiens (Human)
Description:P08246
Residue:267
BDBM50035947
NameBDBM50035947
Synonyms:2-{3-[4-(4-Chloro-benzenesulfonylaminocarbonyl)-benzenesulfonylamino]-2-oxo-6-phenyl-2H-pyridin-1-yl}-N-(3,3,3-trifluoro-1-isopropyl-2-oxo-propyl)-acetamide | CHEMBL303493
TypeSmall organic molecule
Emp. Form.C32H28ClF3N4O8S2
Mol. Mass.753.165
SMILESCC(C)C(NC(=O)Cn1c(ccc(NS(=O)(=O)c2ccc(cc2)C(=O)NS(=O)(=O)c2ccc(Cl)cc2)c1=O)-c1ccccc1)C(=O)C(F)(F)F