Reaction Details
TargetNeutrophil elastase
LigandBDBM50036093
Substrate/Competitorn/a
Meas. Tech.ChEMBL_63838 (CHEMBL674888)
Ki 101±n/a nM
Citation Leung, DAbbenante, GFairlie, DP Protease inhibitors: current status and future prospects. J Med Chem43:305-41 (2000) Neutrophil elastase
Name:Neutrophil elastase
Type:Enzyme
Mol. Mass.:28532.38
Organism:Homo sapiens (Human)
Description:P08246
Residue:267
BDBM50036093
NameBDBM50036093
Synonyms:2-[5-Amino-2-(4-fluoro-phenyl)-6-oxo-6H-pyrimidin-1-yl]-N-(3,3,3-trifluoro-1-isopropyl-2-oxo-propyl)-acetamide | CHEMBL428848
TypeSmall organic molecule
Emp. Form.C18H18F4N4O3
Mol. Mass.414.3541
SMILESCC(C)C(NC(=O)Cn1c(ncc(N)c1=O)-c1ccc(F)cc1)C(=O)C(F)(F)F