Reaction Details
TargetCaspase-3
LigandBDBM50072044
Substrate/Competitorn/a
Meas. Tech.ChEMBL_46671 (CHEMBL658630)
IC50>10000±n/a nM
Citation Leung, DAbbenante, GFairlie, DP Protease inhibitors: current status and future prospects. J Med Chem43:305-41 (2000) Caspase-3
Name:Caspase-3
Type:Hydrolase; heterotetramer of two heterodimers
Mol. Mass.:31607.55
Organism:Homo sapiens (Human)
Description:n/a
Residue:277
BDBM50072044
NameBDBM50072044
Synonyms:CHEMBL419508 [4-(2-Hydroxy-5-oxo-tetrahydro-furan-3-ylcarbamoyl)-6-oxo-decahydro-pyrido[1,2-a]azepin-7-yl]-carbamic acid benzyl ester
TypeSmall organic molecule
Emp. Form.C23H29N3O7
Mol. Mass.459.4923
SMILESOC1OC(=O)C[C@@H]1NC(=O)[C@@H]1CCC[C@@H]2CCC[C@H](NC(=O)OCc3ccccc3)C(=O)N12