Reaction Details
TargetAngiotensin-converting enzyme
LigandBDBM50021153
Substrate/Competitorn/a
Meas. Tech.ChEMBL_36899 (CHEMBL648689)
IC50 1.7±n/a nM
Citation Leung, DAbbenante, GFairlie, DP Protease inhibitors: current status and future prospects. J Med Chem43:305-41 (2000) Angiotensin-converting enzyme
Name:Angiotensin-converting enzyme
Type:Enzyme
Mol. Mass.:149709.01
Organism:Homo sapiens (Human)
Description:n/a
Residue:1306
BDBM50021153
NameBDBM50021153
Synonyms:1H-1-Benzazepine-1-acetic acid, 3-((1-(ethoxycarbonyl)-3-phenylpropyl)amino)-2,3,4,5-tetrahydro-2-oxo-, (S-(R*,R*))- CHEMBL838 | [(3S)-3-{[(1S)-1-(ethoxycarbonyl)-3-phenylpropyl]amino}-2-oxo-2,3,4,5-tetrahydro-1H-1-benzazepin-1-yl]acetic acid
TypeSmall organic molecule
Emp. Form.C24H28N2O5
Mol. Mass.424.4895
SMILESCCOC(=O)[C@H](CCc1ccccc1)N[C@H]1CCc2ccccc2N(CC(O)=O)C1=O