Reaction Details
TargetPepsin A
LigandBDBM50084651
Substrate/Competitorn/a
Meas. Tech.ChEMBL_223311 (CHEMBL846938)
IC50 2100±n/a nM
Citation Leung, DAbbenante, GFairlie, DP Protease inhibitors: current status and future prospects. J Med Chem43:305-41 (2000) Pepsin A
Name:Pepsin A
Type:Enzyme
Mol. Mass.:41232.87
Organism:Porcine
Description:n/a
Residue:385
BDBM50084651
NameBDBM50084651
Synonyms:3-{2-[2-Benzyl-4-(4-methylamino-piperidin-1-yl)-4-oxo-butyrylamino]-3-methylsulfanyl-propionylamino}-4-cyclohexyl-2-hydroxy-butyric acid isopropyl ester(CP-108,671) CP-108671
TypeSmall organic molecule
Emp. Form.C34H54N4O6S
Mol. Mass.646.881
SMILESCNC1CCN(CC1)C(=O)C[C@@H](Cc1ccccc1)C(=O)N[C@@H](CSC)C(=O)N[C@@H](CC1CCCCC1)[C@@H](O)C(=O)OC(C)C