Reaction Details
TargetProcathepsin L
LigandBDBM50084650
Substrate/Competitorn/a
Meas. Tech.ChEMBL_216709 (CHEMBL818674)
IC50 0.850±n/a nM
Citation Leung, DAbbenante, GFairlie, DP Protease inhibitors: current status and future prospects. J Med Chem43:305-41 (2000) Procathepsin L
Name:Procathepsin L
Type:Enzyme
Mol. Mass.:37557.19
Organism:Homo sapiens (Human)
Description:Purchased from Calbiochem (San Diego, CA).
Residue:333
BDBM50084650
NameBDBM50084650
Synonyms:CHEMBL177914 {1-[1-Formyl-2-(4-hydroxy-phenyl)-ethylcarbamoyl]-2-phenyl-ethyl}-carbamic acid benzyl ester(Cbz-Phe-Tyr-CHO)
TypeSmall organic molecule
Emp. Form.C26H26N2O5
Mol. Mass.446.495
SMILESOc1ccc(C[C@H](NC(=O)[C@H](Cc2ccccc2)NC(=O)OCc2ccccc2)C=O)cc1