Reaction Details
TargetProthrombin
LigandBDBM50369774
Substrate/Competitorn/a
Meas. Tech.ChEMBL_154908 (CHEMBL873412)
Ki 2500±n/a nM
Citation Leung, DAbbenante, GFairlie, DP Protease inhibitors: current status and future prospects. J Med Chem43:305-41 (2000) Prothrombin
Name:Prothrombin
Type:Protein
Mol. Mass.:70029.57
Organism:Homo sapiens (Human)
Description:P00734
Residue:622
BDBM50369774
NameBDBM50369774
Synonyms:SEPIMOSTAT MESYLATE | Sepimostat
TypeSmall organic molecule
Emp. Form.C21H19N5O2
Mol. Mass.373.4079
SMILESNC(=N)c1ccc2cc(OC(=O)c3ccc(NC4=NCCN4)cc3)ccc2c1