Reaction Details
TargetCollagenase 3
LigandBDBM50082556
Substrate/Competitorn/a
Meas. Tech.ChEMBL_106612 (CHEMBL717449)
Ki 0.038±n/a nM
Citation Leung, DAbbenante, GFairlie, DP Protease inhibitors: current status and future prospects. J Med Chem43:305-41 (2000) Collagenase 3
Name:Collagenase 3
Type:Enzyme
Mol. Mass.:53808.06
Organism:Homo sapiens (Human)
Description:P45452
Residue:471
BDBM50082556
NameBDBM50082556
Synonyms:(S)-2,2-Dimethyl-4-[4-(pyridin-4-yloxy)-benzenesulfonyl]-thiomorpholine-3-carboxylic acid hydroxyamide 2,2-Dimethyl-4-[4-(pyridin-4-yloxy)-benzenesulfonyl]-thiomorpholine-3-carboxylic acid hydroxyamide 2,2-Dimethyl-4-[4-(pyridin-4-yloxy)-benzenesulfonyl]-thiomorpholine-3-carboxylic acid hydroxyamide(prinomastat) CHEMBL75094 | Prinomastat
TypeSmall organic molecule
Emp. Form.C18H21N3O5S2
Mol. Mass.423.506
SMILESCC1(C)SCCN([C@H]1C(=O)NO)S(=O)(=O)c1ccc(Oc2ccncc2)cc1