Reaction Details
TargetCoagulation factor X
LigandBDBM50369774
Substrate/Competitorn/a
Meas. Tech.ChEMBL_48989 (CHEMBL662872)
Ki 20400±n/a nM
Citation Leung, DAbbenante, GFairlie, DP Protease inhibitors: current status and future prospects. J Med Chem43:305-41 (2000) Coagulation factor X
Name:Coagulation factor X
Type:Enzyme
Mol. Mass.:54726.60
Organism:Homo sapiens (Human)
Description:n/a
Residue:488
BDBM50369774
NameBDBM50369774
Synonyms:SEPIMOSTAT MESYLATE | Sepimostat
TypeSmall organic molecule
Emp. Form.C21H19N5O2
Mol. Mass.373.4079
SMILESNC(=N)c1ccc2cc(OC(=O)c3ccc(NC4=NCCN4)cc3)ccc2c1