Reaction Details
TargetProcathepsin L
LigandBDBM50084674
Substrate/Competitorn/a
Meas. Tech.ChEMBL_216709 (CHEMBL818674)
IC50 0.74±n/a nM
Citation Leung, DAbbenante, GFairlie, DP Protease inhibitors: current status and future prospects. J Med Chem43:305-41 (2000) Procathepsin L
Name:Procathepsin L
Type:Enzyme
Mol. Mass.:37557.19
Organism:Homo sapiens (Human)
Description:Purchased from Calbiochem (San Diego, CA).
Residue:333
BDBM50084674
NameBDBM50084674
Synonyms:CHEMBL115394 | [1-(1-Formyl-2-phenyl-ethylcarbamoyl)-2-phenyl-ethyl]-carbamic acid benzyl ester(Cbz-Phe-Phe-CHO)
TypeSmall organic molecule
Emp. Form.C26H26N2O4
Mol. Mass.430.4956
SMILESO=CC(Cc1ccccc1)NC(=O)C(Cc1ccccc1)NC(=O)OCc1ccccc1