Reaction Details
Target72 kDa type IV collagenase
LigandBDBM50084630
Substrate/Competitorn/a
Meas. Tech.ChEMBL_104534 (CHEMBL718311)
Ki 3000±n/a nM
Citation Leung, DAbbenante, GFairlie, DP Protease inhibitors: current status and future prospects. J Med Chem43:305-41 (2000) 72 kDa type IV collagenase
Name:72 kDa type IV collagenase
Type:Enzyme
Mol. Mass.:73870.36
Organism:Homo sapiens (Human)
Description: P08253
Residue:660
BDBM50084630
NameBDBM50084630
Synonyms:CHEMBL114673 | N-Methyl-3-pentafluorophenyl-2-[3-(5-thioxo-4,5-dihydro-[1,3,4]thiadiazol-2-yl)-ureido]-propionamide
TypeSmall organic molecule
Emp. Form.C13H10F5N5O2S2
Mol. Mass.427.373
SMILESCNC(=O)[C@@H](Cc1c(F)c(F)c(F)c(F)c1F)NC(=O)Nc1nnc(S)s1