Reaction Details
TargetNeprilysin
LigandBDBM50084679
Substrate/Competitorn/a
Meas. Tech.ChEMBL_64981 (CHEMBL675566)
IC50 11±n/a nM
Citation Leung, DAbbenante, GFairlie, DP Protease inhibitors: current status and future prospects. J Med Chem43:305-41 (2000) Neprilysin
Name:Neprilysin
Type:Protein
Mol. Mass.:85789.59
Organism:Rattus norvegicus (Rat)
Description:P07861
Residue:750
BDBM50084679
NameBDBM50084679
Synonyms:2-[1-(2-Carboxy-2-hydroxy-ethylcarbamoyl)-2-phenyl-ethylamino]-4-phenyl-butyric acid(SCH39370) SCH-39370
TypeSmall organic molecule
Emp. Form.C22H26N2O6
Mol. Mass.414.4516
SMILESO[C@@H](CNC(=O)[C@H](Cc1ccccc1)NC(CCc1ccccc1)C(O)=O)C(O)=O