Reaction Details
TargetAngiotensin-converting enzyme
LigandBDBM50084628
Substrate/Competitorn/a
Meas. Tech.ChEMBL_36904 (CHEMBL649540)
Ki 9.80±n/a nM
Citation Leung, DAbbenante, GFairlie, DP Protease inhibitors: current status and future prospects. J Med Chem43:305-41 (2000) Angiotensin-converting enzyme
Name:Angiotensin-converting enzyme
Type:Enzyme
Mol. Mass.:149709.01
Organism:Homo sapiens (Human)
Description:n/a
Residue:1306
BDBM50084628
NameBDBM50084628
Synonyms:2-(2-Benzo[1,3]dioxol-5-ylmethyl-3-carboxysulfanyl-propionylamino)-propionic acid benzyl ester(Fasidotrilat) | CHEMBL325055
TypeSmall organic molecule
Emp. Form.C22H23NO7S
Mol. Mass.445.486
SMILESC[C@H](NC(=O)[C@@H](CSC(O)=O)Cc1ccc2OCOc2c1)C(=O)OCc1ccccc1