Reaction Details
TargetAngiotensin-converting enzyme
LigandBDBM50084679
Substrate/Competitorn/a
Meas. Tech.ChEMBL_36899 (CHEMBL648689)
IC50>10000±n/a nM
Citation Leung, DAbbenante, GFairlie, DP Protease inhibitors: current status and future prospects. J Med Chem43:305-41 (2000) Angiotensin-converting enzyme
Name:Angiotensin-converting enzyme
Type:Enzyme
Mol. Mass.:149709.01
Organism:Homo sapiens (Human)
Description:n/a
Residue:1306
BDBM50084679
NameBDBM50084679
Synonyms:2-[1-(2-Carboxy-2-hydroxy-ethylcarbamoyl)-2-phenyl-ethylamino]-4-phenyl-butyric acid(SCH39370) SCH-39370
TypeSmall organic molecule
Emp. Form.C22H26N2O6
Mol. Mass.414.4516
SMILESO[C@@H](CNC(=O)[C@H](Cc1ccccc1)NC(CCc1ccccc1)C(O)=O)C(O)=O