Reaction Details
TargetStromelysin-1
LigandBDBM30344
Substrate/Competitorn/a
Meas. Tech.ChEMBL_104750 (CHEMBL715875)
Ki 527±n/a nM
Citation Leung, DAbbenante, GFairlie, DP Protease inhibitors: current status and future prospects. J Med Chem43:305-41 (2000) Stromelysin-1
Name:Stromelysin-1
Type:Enzyme
Mol. Mass.:53973.13
Organism:Homo sapiens (Human)
Description: P08254
Residue:477
BDBM30344
NameBDBM30344
Synonyms:Cipemastat | Trocade
TypeSmall organic molecule
Emp. Form.C22H36N4O5
Mol. Mass.436.545
SMILESCN1C(=O)N(C[C@@H]([C@@H](CC2CCCC2)C(=O)N2CCCCC2)C(=O)NO)C(=O)C1(C)C