Reaction Details
TargetRenin
LigandBDBM50084618
Substrate/Competitorn/a
Meas. Tech.ChEMBL_196433 (CHEMBL878013)
IC50 7.1±n/a nM
Citation Leung, DAbbenante, GFairlie, DP Protease inhibitors: current status and future prospects. J Med Chem43:305-41 (2000) Renin
Name:Renin
Type:Enzyme
Mol. Mass.:45058.99
Organism:Homo sapiens (Human)
Description:n/a
Residue:406
BDBM50084618
NameBDBM50084618
Synonyms:5-{2-[3-Benzyl-4-(4-methyl-piperazine-1-carbonyl)-2-oxo-piperazin-1-yl]-hexanoylamino}-6-cyclohexyl-4-hydroxy-2-isopropyl-hexanoic acid propylamide(pepstatin(A-70450)) CHEMBL325071
TypeSmall organic molecule
Emp. Form.C41H68N6O5
Mol. Mass.725.0158
SMILESCCCC[C@H](N1CCN([C@H](Cc2ccccc2)C1=O)C(=O)N1CCN(C)CC1)C(=O)N[C@@H](CC1CCCCC1)[C@@H](O)C[C@@H](C(C)C)C(=O)NCCC