Reaction Details
TargetProthrombin
LigandBDBM50084682
Substrate/Competitorn/a
Meas. Tech.ChEMBL_208886 (CHEMBL814943)
Ki 0.21±n/a nM
Citation Leung, DAbbenante, GFairlie, DP Protease inhibitors: current status and future prospects. J Med Chem43:305-41 (2000) Prothrombin
Name:Prothrombin
Type:Protein
Mol. Mass.:70029.57
Organism:Homo sapiens (Human)
Description:P00734
Residue:622
BDBM50084682
NameBDBM50084682
Synonyms:1-[3-(4-Carbamimidoyl-phenyl)-2-(2-methyl-1,2,3,4-tetrahydro-isoquinoline-7-sulfonylamino)-propionyl]-4-methyl-1,2,3,6-tetrahydro-pyridine-2-carboxylic acid CHEMBL40854
TypeSmall organic molecule
Emp. Form.C33H48BN5O5S
Mol. Mass.637.641
SMILESCc1cc(ccc1C(=O)N[C@@H](CCCNC(N)=N)B1O[C@@H]2CC3CC(C3(C)C)[C@]2(C)O1)-c1ccccc1S(=O)(=O)NC(C)(C)C