Reaction Details
TargetCaspase-1
LigandBDBM50072044
Substrate/Competitorn/a
Meas. Tech.ChEMBL_90858 (CHEMBL699294)
IC50 36±n/a nM
Citation Leung, DAbbenante, GFairlie, DP Protease inhibitors: current status and future prospects. J Med Chem43:305-41 (2000) Caspase-1
Name:Caspase-1
Type:Enzyme
Mol. Mass.:45154.13
Organism:Homo sapiens (Human)
Description:P29466
Residue:404
BDBM50072044
NameBDBM50072044
Synonyms:CHEMBL419508 [4-(2-Hydroxy-5-oxo-tetrahydro-furan-3-ylcarbamoyl)-6-oxo-decahydro-pyrido[1,2-a]azepin-7-yl]-carbamic acid benzyl ester
TypeSmall organic molecule
Emp. Form.C23H29N3O7
Mol. Mass.459.4923
SMILESOC1OC(=O)C[C@@H]1NC(=O)[C@@H]1CCC[C@@H]2CCC[C@H](NC(=O)OCc3ccccc3)C(=O)N12