Reaction Details
TargetProthrombin
LigandBDBM50062632
Substrate/Competitorn/a
Meas. Tech.ChEMBL_208886 (CHEMBL814943)
Ki 1.5±n/a nM
Citation Leung, DAbbenante, GFairlie, DP Protease inhibitors: current status and future prospects. J Med Chem43:305-41 (2000) Prothrombin
Name:Prothrombin
Type:Protein
Mol. Mass.:70029.57
Organism:Homo sapiens (Human)
Description:P00734
Residue:622
BDBM50062632
NameBDBM50062632
Synonyms:(S)-1-(9-Hydroxy-9H-fluorene-9-carbonyl)-pyrrolidine-2-carboxylic acid (4-amino-cyclohexylmethyl)-amide CHEMBL262967
TypeSmall organic molecule
Emp. Form.C26H31N3O3
Mol. Mass.433.5426
SMILESNC1CCC(CNC(=O)[C@@H]2CCCN2C(=O)C2(O)c3ccccc3-c3ccccc23)CC1