Reaction Details
TargetCalpain-1 catalytic subunit
LigandBDBM50084655
Substrate/Competitorn/a
Meas. Tech.ChEMBL_43844 (CHEMBL658506)
IC50 40±n/a nM
Citation Leung, DAbbenante, GFairlie, DP Protease inhibitors: current status and future prospects. J Med Chem43:305-41 (2000) Calpain-1 catalytic subunit
Name:Calpain-1 catalytic subunit
Type:Protein
Mol. Mass.:81880.51
Organism:Homo sapiens (Human)
Description:n/a
Residue:714
BDBM50084655
NameBDBM50084655
Synonyms:CHEMBL92708 Z-Leu-Nle-CHO [1-((S)-(S)-1-Formyl-pentylcarbamoyl)-3-methyl-butyl]-carbamic acid benzyl ester [1-(1-Formyl-pentylcarbamoyl)-3-methyl-butyl]-carbamic acid benzyl ester(calpeptin) | benzyl (S)-4-methyl-1-oxo-1-((S)-1-oxohexan-2-ylamino)pentan-2-ylcarbamate
TypeSmall organic molecule
Emp. Form.C20H30N2O4
Mol. Mass.362.4632
SMILESCCCC[C@H](NC(=O)[C@H](CC(C)C)NC(=O)OCc1ccccc1)C=O