Reaction Details
TargetMu-type opioid receptor
LigandBDBM50021347
Substrate/Competitorn/a
Meas. Tech.ChEMBL_148092 (CHEMBL751574)
Ki 0.020000±n/a nM
Citation Subramanian, GPaterlini, MGPortoghese, PSFerguson, DM Molecular docking reveals a novel binding site model for fentanyl at the mu-opioid receptor. J Med Chem43:381-91 (2000) Mu-type opioid receptor
Name:Mu-type opioid receptor
Type:G Protein-Coupled Receptor (GPCR)
Mol. Mass.:44789.51
Organism:Homo sapiens (Human)
Description:P35372
Residue:400
BDBM50021347
NameBDBM50021347
Synonyms:CHEMBL12391 N-(3-Methyl-1-phenethyl-piperidin-4-yl)-N-phenyl-propionamide((3R,4S)-cis-3-methylfentanyl)
TypeSmall organic molecule
Emp. Form.C23H30N2O
Mol. Mass.350.4971
SMILESCCC(=O)N([C@H]1CCN(CCc2ccccc2)C[C@H]1C)c1ccccc1