Reaction Details
TargetNeprilysin
LigandBDBM50084895
Substrate/Competitorn/a
Meas. Tech.ChEMBL_140876 (CHEMBL752507)
IC50 12±n/a nM
Citation De Lombaert, SBlanchard, LStamford, LBTan, JWallace, EMSatoh, YFitt, JHoyer, DSimonsbergen, DMoliterni, JMarcopoulos, NSavage, PChou, MTrapani, AJJeng, AY Potent and selective non-peptidic inhibitors of endothelin-converting enzyme-1 with sustained duration of action. J Med Chem43:488-504 (2000) Neprilysin
Name:Neprilysin
Type:Protein
Mol. Mass.:85789.59
Organism:Rattus norvegicus (Rat)
Description:P07861
Residue:750
BDBM50084895
NameBDBM50084895
Synonyms:2-[(S)-3-Dibenzofuran-3-yl-2-(phosphonomethyl-amino)-propionylamino]-3-phenyl-propionic acid CHEMBL413724
TypeSmall organic molecule
Emp. Form.C25H25N2O7P
Mol. Mass.496.449
SMILESOC(=O)C(Cc1ccccc1)NC(=O)[C@H](Cc1ccc2c(c1)oc1ccccc21)NCP(O)(O)=O