Reaction Details
TargetNeprilysin
LigandBDBM50064096
Substrate/Competitorn/a
Meas. Tech.ChEMBL_140876 (CHEMBL752507)
IC50 14±n/a nM
Citation De Lombaert, SBlanchard, LStamford, LBTan, JWallace, EMSatoh, YFitt, JHoyer, DSimonsbergen, DMoliterni, JMarcopoulos, NSavage, PChou, MTrapani, AJJeng, AY Potent and selective non-peptidic inhibitors of endothelin-converting enzyme-1 with sustained duration of action. J Med Chem43:488-504 (2000) Neprilysin
Name:Neprilysin
Type:Protein
Mol. Mass.:85789.59
Organism:Rattus norvegicus (Rat)
Description:P07861
Residue:750
BDBM50064096
NameBDBM50064096
Synonyms:CHEMBL40028 {[4-(2-Fluoro-phenyl)-1-(1H-tetrazol-5-yl)-but-3-ynylamino]-methyl}-phosphonic acid
TypeSmall organic molecule
Emp. Form.C12H13FN5O3P
Mol. Mass.325.2355
SMILESOP(O)(=O)CN[C@@H](CC#Cc1ccccc1F)c1nnn[nH]1