Reaction Details
TargetTripeptidyl-peptidase 2
LigandBDBM50085083
Substrate/Competitorn/a
Meas. Tech.ChEMBL_211948 (CHEMBL816538)
Ki 1000±n/a nM
Citation Ganellin, CRBishop, PBBambal, RBChan, SMLaw, JKMarabout, BLuthra, PMMoore, ANPeschard, OBourgeat, PRose, CVargas, FSchwartz, JC Inhibitors of tripeptidyl peptidase II. 2. Generation of the first novel lead inhibitor of cholecystokinin-8-inactivating peptidase: a strategy for the design of peptidase inhibitors. J Med Chem43:664-74 (2000) Tripeptidyl-peptidase 2
Name:Tripeptidyl-peptidase 2
Type:PROTEIN
Mol. Mass.:138287.08
Organism:Rattus norvegicus
Description:ChEMBL_211948
Residue:1249
BDBM50085083
NameBDBM50085083
Synonyms:2-{[1-(2-Amino-3-methyl-pentanoyl)-pyrrolidine-2-carbonyl]-amino}-3-methyl-pentanoic acid | CHEMBL158110
TypeSmall organic molecule
Emp. Form.C17H31N3O4
Mol. Mass.341.4457
SMILESCCC(C)C(N)C(=O)N1CCCC1C(=O)NC(C(C)CC)C(O)=O