Reaction Details
TargetTripeptidyl-peptidase 2
LigandBDBM50085117
Substrate/Competitorn/a
Meas. Tech.ChEMBL_211948 (CHEMBL816538)
Ki 11000±n/a nM
Citation Ganellin, CRBishop, PBBambal, RBChan, SMLaw, JKMarabout, BLuthra, PMMoore, ANPeschard, OBourgeat, PRose, CVargas, FSchwartz, JC Inhibitors of tripeptidyl peptidase II. 2. Generation of the first novel lead inhibitor of cholecystokinin-8-inactivating peptidase: a strategy for the design of peptidase inhibitors. J Med Chem43:664-74 (2000) Tripeptidyl-peptidase 2
Name:Tripeptidyl-peptidase 2
Type:PROTEIN
Mol. Mass.:138287.08
Organism:Rattus norvegicus
Description:ChEMBL_211948
Residue:1249
BDBM50085117
NameBDBM50085117
Synonyms:2-Amino-N-[2-(4-hydroxy-phenyl)-1-methylcarbamoyl-ethyl]-3-methyl-butyramide (0.25H2O) | CHEMBL158049
TypeSmall organic molecule
Emp. Form.C15H23N3O3
Mol. Mass.293.3614
SMILESCNC(=O)C(Cc1ccc(O)cc1)NC(=O)C(N)C(C)C